Reaction Details
TargetD(2) dopamine receptor
LigandBDBM50219140
Substrate/Competitorn/a
Meas. Tech.ChEMBL_491080 (CHEMBL982103)
Ki 24.55±n/a nM
Citation Enzensperger, CGörnemann, TPertz, HHLehmann, J Dopamine/serotonin receptor ligands. Part 17: a cross-target SAR approach: affinities of azecine-styled ligands for 5-HT(2A) versus D1 and D2 receptors. Bioorg Med Chem Lett18:3809-13 (2008) 
 
D(2) dopamine receptor
Name:D(2) dopamine receptor
Type:Cell-surface receptors
Mol. Mass.:50647.10
Organism:Homo sapiens (Human)
Description:P14416
Residue:443
BDBM50219140
NameBDBM50219140
Synonyms:12-methoxy-7-methyl-6,7,8,9,10,15-hexahydro-5H-dibenzo[d,g]azacycloundecene CHEMBL389357
TypeSmall organic molecule
Emp. Form.C20H25NO
Mol. Mass.295.4186
SMILESCOc1ccc2Cc3ccccc3CCN(C)CCCc2c1