Reaction Details
Target5-hydroxytryptamine receptor 1A
LigandBDBM50412440
Substrate/Competitorn/a
Meas. Tech.ChEMBL_537446 (CHEMBL990611)
Ki 2.51±n/a nM
Citation Serafinowska, HTBlaney, FELovell, PJMerlo, GGScott, CMSmith, PWStarr, KRWatson, JM Novel 5-HT(1A/1B/1D) receptors antagonists with potent 5-HT reuptake inhibitory activity. Bioorg Med Chem Lett18:5581-5 (2008) 
 
5-hydroxytryptamine receptor 1A
Name:5-hydroxytryptamine receptor 1A
Type:n/a
Mol. Mass.:46122.49
Organism:Homo sapiens (Human)
Description:n/a
Residue:422
BDBM50412440
NameBDBM50412440
Synonyms:CHEMBL485395
TypeSmall organic molecule
Emp. Form.C25H28N4O2
Mol. Mass.416.5154
SMILESCc1ccc2c(cccc2n1)N1CCN(CCCc2ccc3OCC(=O)Nc3c2)CC1