Reaction Details
Target5-hydroxytryptamine receptor 1A
LigandBDBM50412442
Substrate/Competitorn/a
Meas. Tech.ChEMBL_537446 (CHEMBL990611)
Ki 158.49±n/a nM
Citation Serafinowska, HTBlaney, FELovell, PJMerlo, GGScott, CMSmith, PWStarr, KRWatson, JM Novel 5-HT(1A/1B/1D) receptors antagonists with potent 5-HT reuptake inhibitory activity. Bioorg Med Chem Lett18:5581-5 (2008) 
 
5-hydroxytryptamine receptor 1A
Name:5-hydroxytryptamine receptor 1A
Type:n/a
Mol. Mass.:46122.49
Organism:Homo sapiens (Human)
Description:n/a
Residue:422
BDBM50412442
NameBDBM50412442
Synonyms:CHEMBL519019
TypeSmall organic molecule
Emp. Form.C24H25N3O4
Mol. Mass.419.473
SMILESCc1ccc2c(OCCCN3CC(C3)Oc3ccc4OCC(=O)Nc4c3)cccc2n1