Reaction Details
Target5-hydroxytryptamine receptor 1D
LigandBDBM50412433
Substrate/Competitorn/a
Meas. Tech.ChEMBL_537448 (CHEMBL990613)
Ki 158.49±n/a nM
Citation Serafinowska, HTBlaney, FELovell, PJMerlo, GGScott, CMSmith, PWStarr, KRWatson, JM Novel 5-HT(1A/1B/1D) receptors antagonists with potent 5-HT reuptake inhibitory activity. Bioorg Med Chem Lett18:5581-5 (2008) 
 
5-hydroxytryptamine receptor 1D
Name:5-hydroxytryptamine receptor 1D
Type:G Protein-Coupled Receptor (GPCR)
Mol. Mass.:41920.63
Organism:Homo sapiens (Human)
Description:Receptor binding assays were performed using human clone stably expressed in CHO cells.
Residue:377
BDBM50412433
NameBDBM50412433
Synonyms:CHEMBL519010
TypeSmall organic molecule
Emp. Form.C25H27N3O4
Mol. Mass.433.4996
SMILESCc1ccc2c(OCCCN3CC(COc4ccc5OCC(=O)Nc5c4)C3)cccc2n1