Reaction Details
TargetSodium-dependent serotonin transporter
LigandBDBM50412439
Substrate/Competitorn/a
Meas. Tech.ChEMBL_537449 (CHEMBL990614)
Ki 63.1±n/a nM
Citation Serafinowska, HTBlaney, FELovell, PJMerlo, GGScott, CMSmith, PWStarr, KRWatson, JM Novel 5-HT(1A/1B/1D) receptors antagonists with potent 5-HT reuptake inhibitory activity. Bioorg Med Chem Lett18:5581-5 (2008) 
 
Sodium-dependent serotonin transporter
Name:Sodium-dependent serotonin transporter
Type:Multi-pass membrane protein
Mol. Mass.:70168.43
Organism:Rattus norvegicus (rat)
Description:P31652
Residue:630
BDBM50412439
NameBDBM50412439
Synonyms:CHEMBL484387
TypeSmall organic molecule
Emp. Form.C24H25N3O4
Mol. Mass.419.473
SMILESCc1ccc2c(OCCN3CC(COc4ccc5OCC(=O)Nc5c4)C3)cccc2n1