Reaction Details
Target5-hydroxytryptamine receptor 1D
LigandBDBM50412445
Substrate/Competitorn/a
Meas. Tech.ChEMBL_537448 (CHEMBL990613)
Ki 251.19±n/a nM
Citation Serafinowska, HTBlaney, FELovell, PJMerlo, GGScott, CMSmith, PWStarr, KRWatson, JM Novel 5-HT(1A/1B/1D) receptors antagonists with potent 5-HT reuptake inhibitory activity. Bioorg Med Chem Lett18:5581-5 (2008) 
 
5-hydroxytryptamine receptor 1D
Name:5-hydroxytryptamine receptor 1D
Type:G Protein-Coupled Receptor (GPCR)
Mol. Mass.:41920.63
Organism:Homo sapiens (Human)
Description:Receptor binding assays were performed using human clone stably expressed in CHO cells.
Residue:377
BDBM50412445
NameBDBM50412445
Synonyms:CHEMBL485630
TypeSmall organic molecule
Emp. Form.C26H27N3O4
Mol. Mass.445.5103
SMILESCc1ccc2c(OCC3CCN(CC(=O)c4ccc5OCC(=O)Nc5c4)CC3)cccc2n1