Reaction Details
TargetSodium-dependent serotonin transporter
LigandBDBM50412446
Substrate/Competitorn/a
Meas. Tech.ChEMBL_537449 (CHEMBL990614)
Ki 31.62±n/a nM
Citation Serafinowska, HTBlaney, FELovell, PJMerlo, GGScott, CMSmith, PWStarr, KRWatson, JM Novel 5-HT(1A/1B/1D) receptors antagonists with potent 5-HT reuptake inhibitory activity. Bioorg Med Chem Lett18:5581-5 (2008) 
 
Sodium-dependent serotonin transporter
Name:Sodium-dependent serotonin transporter
Type:Multi-pass membrane protein
Mol. Mass.:70168.43
Organism:Rattus norvegicus (rat)
Description:P31652
Residue:630
BDBM50412446
NameBDBM50412446
Synonyms:CHEMBL484743
TypeSmall organic molecule
Emp. Form.C25H27N3O3
Mol. Mass.417.5002
SMILESCc1ccc2c(OCC3CCN(Cc4ccc5OCC(=O)Nc5c4)CC3)cccc2n1