Reaction Details
TargetAcetylcholinesterase
LigandBDBM50412453
Substrate/Competitorn/a
Meas. Tech.ChEMBL_536575 (CHEMBL988036)
IC50 11220.18±n/a nM
Citation Morini, GComini, MRivara, MRivara, SBordi, FPlazzi, PVFlammini, LSaccani, FBertoni, SBallabeni, VBarocelli, EMor, M Synthesis and structure-activity relationships for biphenyl H3 receptor antagonists with moderate anti-cholinesterase activity. Bioorg Med Chem16:9911-24 (2008) 
 
Acetylcholinesterase
Name:Acetylcholinesterase
Type:Enzyme
Mol. Mass.:68193.62
Organism:Rattus norvegicus (rat)
Description:P37136
Residue:614
BDBM50412453
NameBDBM50412453
Synonyms:CHEMBL458507
TypeSmall organic molecule
Emp. Form.C26H36N2O
Mol. Mass.392.5768
SMILESCCCN(CCC)C(=O)Cc1ccc(cc1)-c1ccc(CN2CCCCC2)cc1