Reaction Details
TargetHistamine H3 receptor
LigandBDBM50412455
Substrate/Competitorn/a
Meas. Tech.ChEMBL_536770 (CHEMBL984564)
Ki 15.85±n/a nM
Citation Morini, GComini, MRivara, MRivara, SBordi, FPlazzi, PVFlammini, LSaccani, FBertoni, SBallabeni, VBarocelli, EMor, M Synthesis and structure-activity relationships for biphenyl H3 receptor antagonists with moderate anti-cholinesterase activity. Bioorg Med Chem16:9911-24 (2008) 
 
Histamine H3 receptor
Name:Histamine H3 receptor
Type:G Protein-Coupled Receptor (GPCR)
Mol. Mass.:48607.98
Organism:Rattus norvegicus (rat)
Description:n/a
Residue:445
BDBM50412455
NameBDBM50412455
Synonyms:CHEMBL458723
TypeSmall organic molecule
Emp. Form.C19H38N2
Mol. Mass.294.5184
SMILESC(CCCCN1CCCCC1)CCCCN1CCCCC1