Reaction Details
TargetHistamine H3 receptor
LigandBDBM50412469
Substrate/Competitorn/a
Meas. Tech.ChEMBL_536769 (CHEMBL984563)
Ki 2±n/a nM
Citation Morini, GComini, MRivara, MRivara, SBordi, FPlazzi, PVFlammini, LSaccani, FBertoni, SBallabeni, VBarocelli, EMor, M Synthesis and structure-activity relationships for biphenyl H3 receptor antagonists with moderate anti-cholinesterase activity. Bioorg Med Chem16:9911-24 (2008) 
 
Histamine H3 receptor
Name:Histamine H3 receptor
Type:G Protein-Coupled Receptor (GPCR)
Mol. Mass.:48691.47
Organism:Homo sapiens (Human)
Description:Binding assays were using CHO cells stably expressing hH3R receptors.
Residue:445
BDBM50412469
NameBDBM50412469
Synonyms:CHEMBL459756
TypeSmall organic molecule
Emp. Form.C25H34N2
Mol. Mass.362.5509
SMILESC(Cc1ccc(cc1)-c1ccc(CN2CCCCC2)cc1)N1CCCCC1