Reaction Details
TargetAcetylcholinesterase
LigandBDBM50412447
Substrate/Competitorn/a
Meas. Tech.ChEMBL_536575 (CHEMBL988036)
IC50 5888.44±n/a nM
Citation Morini, GComini, MRivara, MRivara, SBordi, FPlazzi, PVFlammini, LSaccani, FBertoni, SBallabeni, VBarocelli, EMor, M Synthesis and structure-activity relationships for biphenyl H3 receptor antagonists with moderate anti-cholinesterase activity. Bioorg Med Chem16:9911-24 (2008) 
 
Acetylcholinesterase
Name:Acetylcholinesterase
Type:Enzyme
Mol. Mass.:68193.62
Organism:Rattus norvegicus (rat)
Description:P37136
Residue:614
BDBM50412447
NameBDBM50412447
Synonyms:CHEMBL380101
TypeSmall organic molecule
Emp. Form.C24H32N2
Mol. Mass.348.5243
SMILESC(N1CCCCC1)c1ccc(cc1)-c1ccc(CN2CCCCC2)cc1