Reaction Details
TargetAcetylcholinesterase
LigandBDBM50412465
Substrate/Competitorn/a
Meas. Tech.ChEMBL_536575 (CHEMBL988036)
IC50 11481.54±n/a nM
Citation Morini, GComini, MRivara, MRivara, SBordi, FPlazzi, PVFlammini, LSaccani, FBertoni, SBallabeni, VBarocelli, EMor, M Synthesis and structure-activity relationships for biphenyl H3 receptor antagonists with moderate anti-cholinesterase activity. Bioorg Med Chem16:9911-24 (2008) 
 
Acetylcholinesterase
Name:Acetylcholinesterase
Type:Enzyme
Mol. Mass.:68193.62
Organism:Rattus norvegicus (rat)
Description:P37136
Residue:614
BDBM50412465
NameBDBM50412465
Synonyms:CHEMBL211439
TypeSmall organic molecule
Emp. Form.C25H33N3O
Mol. Mass.391.549
SMILESCC(=O)N1CCN(Cc2ccc(cc2)-c2ccc(CN3CCCCC3)cc2)CC1