Reaction Details
TargetHistamine H3 receptor
LigandBDBM50412472
Substrate/Competitorn/a
Meas. Tech.ChEMBL_536770 (CHEMBL984564)
Ki 2.57±n/a nM
Citation Morini, GComini, MRivara, MRivara, SBordi, FPlazzi, PVFlammini, LSaccani, FBertoni, SBallabeni, VBarocelli, EMor, M Synthesis and structure-activity relationships for biphenyl H3 receptor antagonists with moderate anti-cholinesterase activity. Bioorg Med Chem16:9911-24 (2008) 
 
Histamine H3 receptor
Name:Histamine H3 receptor
Type:G Protein-Coupled Receptor (GPCR)
Mol. Mass.:48607.98
Organism:Rattus norvegicus (rat)
Description:n/a
Residue:445
BDBM50412472
NameBDBM50412472
Synonyms:CHEMBL457007
TypeSmall organic molecule
Emp. Form.C23H32N2
Mol. Mass.336.5136
SMILESCCN(CC)Cc1ccc(cc1)-c1ccc(CN2CCCCC2)cc1