Reaction Details
TargetCalcium-activated potassium channel subunit alpha-1
LigandBDBM50412640
Substrate/Competitorn/a
Meas. Tech.ChEMBL_558735 (CHEMBL954137)
IC50 1548.82±n/a nM
Citation Coi, AFiamingo, FLLivi, OCalderone, VMartelli, AMassarelli, IBianucci, AM QSAR studies on BK channel activators. Bioorg Med Chem17:319-25 (2008) 
 
Calcium-activated potassium channel subunit alpha-1
Name:Calcium-activated potassium channel subunit alpha-1
Type:PROTEIN
Mol. Mass.:137567.62
Organism:Homo sapiens (Human)
Description:ChEMBL_938830
Residue:1236
BDBM50412640
NameBDBM50412640
Synonyms:CHEMBL465454
TypeSmall organic molecule
Emp. Form.C13H9N3O2
Mol. Mass.239.2295
SMILESOc1ccccc1C(=O)n1nnc2ccccc12