Reaction Details
TargetCalcium-activated potassium channel subunit alpha-1
LigandBDBM67581
Substrate/Competitorn/a
Meas. Tech.ChEMBL_558735 (CHEMBL954137)
IC50 3090.3±n/a nM
Citation Coi, AFiamingo, FLLivi, OCalderone, VMartelli, AMassarelli, IBianucci, AM QSAR studies on BK channel activators. Bioorg Med Chem17:319-25 (2008) 
 
Calcium-activated potassium channel subunit alpha-1
Name:Calcium-activated potassium channel subunit alpha-1
Type:PROTEIN
Mol. Mass.:137567.62
Organism:Homo sapiens (Human)
Description:ChEMBL_938830
Residue:1236
BDBM67581
NameBDBM67581
Synonyms:MLS000050452 N-(5-chloro-2-hydroxy-phenyl)-2-ethoxy-benzamide SMR000076353 | cid_2953683
TypeSmall organic molecule
Emp. Form.C15H14ClNO3
Mol. Mass.291.73
SMILESCCOc1ccccc1C(=O)Nc1cc(Cl)ccc1O