Reaction Details
TargetCalcium-activated potassium channel subunit alpha-1
LigandBDBM50412656
Substrate/Competitorn/a
Meas. Tech.ChEMBL_558735 (CHEMBL954137)
IC50 10964.78±n/a nM
Citation Coi, AFiamingo, FLLivi, OCalderone, VMartelli, AMassarelli, IBianucci, AM QSAR studies on BK channel activators. Bioorg Med Chem17:319-25 (2008) 
 
Calcium-activated potassium channel subunit alpha-1
Name:Calcium-activated potassium channel subunit alpha-1
Type:PROTEIN
Mol. Mass.:137567.62
Organism:Homo sapiens (Human)
Description:ChEMBL_938830
Residue:1236
BDBM50412656
NameBDBM50412656
Synonyms:CHEMBL480300
TypeSmall organic molecule
Emp. Form.C13H9FN2O4
Mol. Mass.276.22
SMILESOc1ccccc1C(=O)Nc1ccc(F)cc1[N+]([O-])=O