Reaction Details
TargetCalcium-activated potassium channel subunit alpha-1
LigandBDBM50412658
Substrate/Competitorn/a
Meas. Tech.ChEMBL_558735 (CHEMBL954137)
IC50 11748.98±n/a nM
Citation Coi, AFiamingo, FLLivi, OCalderone, VMartelli, AMassarelli, IBianucci, AM QSAR studies on BK channel activators. Bioorg Med Chem17:319-25 (2008) 
 
Calcium-activated potassium channel subunit alpha-1
Name:Calcium-activated potassium channel subunit alpha-1
Type:PROTEIN
Mol. Mass.:137567.62
Organism:Homo sapiens (Human)
Description:ChEMBL_938830
Residue:1236
BDBM50412658
NameBDBM50412658
Synonyms:CHEMBL447035
TypeSmall organic molecule
Emp. Form.C11H8ClNO2S
Mol. Mass.253.705
SMILESOc1ccc(Cl)cc1NC(=O)c1cccs1