Reaction Details
TargetLiver carboxylesterase 1
LigandBDBM50412694
Substrate/Competitorn/a
Meas. Tech.ChEMBL_560263 (CHEMBL1019602)
Ki 3.31±n/a nM
Citation Harada, TNakagawa, YWadkins, RMPotter, PMWheelock, CE Comparison of benzil and trifluoromethyl ketone (TFK)-mediated carboxylesterase inhibition using classical and 3D-quantitative structure-activity relationship analysis. Bioorg Med Chem17:149-64 (2008) 
 
Liver carboxylesterase 1
Name:Liver carboxylesterase 1
Type:Protein
Mol. Mass.:62520.83
Organism:Homo sapiens (Human)
Description:n/a
Residue:567
BDBM50412694
NameBDBM50412694
Synonyms:CHEMBL460808
TypeSmall organic molecule
Emp. Form.C9H17F3O3S
Mol. Mass.262.29
SMILESCCCCCCS(=O)CC(O)(O)C(F)(F)F