Reaction Details
Target5-hydroxytryptamine receptor 2C
LigandBDBM50412727
Substrate/Competitorn/a
Meas. Tech.ChEMBL_539304 (CHEMBL1026422)
Ki 245.47±n/a nM
Citation Aranda, RVillalba, KRaviña, EMasaguer, CFBrea, JAreias, FDomínguez, ESelent, JLópez, LSanz, FPastor, MLoza, MI Synthesis, binding affinity, and molecular docking analysis of new benzofuranone derivatives as potential antipsychotics. J Med Chem51:6085-94 (2008) 
 
5-hydroxytryptamine receptor 2C
Name:5-hydroxytryptamine receptor 2C
Type:G Protein-Coupled Receptor (GPCR)
Mol. Mass.:51836.79
Organism:Homo sapiens (Human)
Description:P28335
Residue:458
BDBM50412727
NameBDBM50412727
Synonyms:CHEMBL492689
TypeSmall organic molecule
Emp. Form.C21H21FN2O3
Mol. Mass.368.4014
SMILESFc1ccc2c(noc2c1)C1CCN(C[C@H]2Cc3occc3C(=O)C2)CC1