Reaction Details
TargetAlpha-1D adrenergic receptor
LigandBDBM69602
Substrate/Competitorn/a
Meas. Tech.ChEMBL_539782 (CHEMBL1035000)
Ki 0.513±n/a nM
Citation Quaglia, WPiergentili, ADel Bello, FFarande, YGiannella, MPigini, MRafaiani, GCarrieri, AAmantini, CLucciarini, RSantoni, GPoggesi, ELeonardi, A Structure-activity relationships in 1,4-benzodioxan-related compounds. 9. From 1,4-benzodioxane to 1,4-dioxane ring as a promising template of novel alpha1D-adrenoreceptor antagonists, 5-HT1A full agonists, and cytotoxic agents. J Med Chem51:6359-70 (2008) 
 
Alpha-1D adrenergic receptor
Name:Alpha-1D adrenergic receptor
Type:Enzyme Catalytic Domain
Mol. Mass.:60485.82
Organism:Homo sapiens (Human)
Description:adrenergic Alpha1D ADRA1D HUMAN::P25100
Residue:572
BDBM69602
NameBDBM69602
Synonyms:2,3-dihydro-1,4-benzodioxin-3-ylmethyl-[2-(2,6-dimethoxyphenoxy)ethyl]amine;hydrochloride MLS000859914 SMR000326775 WB-4101 hydrochloride | cid_11957505
TypeSmall organic molecule
Emp. Form.C19H23NO5
Mol. Mass.345.3896
SMILESCOc1cccc(OC)c1OCCNCC1COc2ccccc2O1