Reaction Details
TargetSalicyl-AMP ligase / salicyl-S-ArCP synthetase
LigandBDBM50412828
Substrate/Competitorn/a
Meas. Tech.ChEMBL_496141 (CHEMBL999364)
Ki 1.4±n/a nM
Citation Gupte, ABoshoff, HIWilson, DJNeres, JLabello, NPSomu, RVXing, CBarry, CEAldrich, CC Inhibition of siderophore biosynthesis by 2-triazole substituted analogues of 5'-O-[N-(salicyl)sulfamoyl]adenosine: antibacterial nucleosides effective against Mycobacterium tuberculosis. J Med Chem51:7495-507 (2009) 
 
Salicyl-AMP ligase / salicyl-S-ArCP synthetase
Name:Salicyl-AMP ligase / salicyl-S-ArCP synthetase
Type:PROTEIN
Mol. Mass.:59275.32
Organism:Mycobacterium tuberculosis
Description:ChEMBL_423930
Residue:565
BDBM50412828
NameBDBM50412828
Synonyms:CHEMBL608843
TypeSmall organic molecule
Emp. Form.C23H27N9O8S
Mol. Mass.589.581
SMILESCC(C)Cc1cn(nn1)-c1nc(N)c2ncn(C3OC(COS(=O)(=O)NC(=O)c4ccccc4O)C(O)C3O)c2n1