Reaction Details
TargetLanosterol synthase
LigandBDBM50128050
Substrate/Competitorn/a
Meas. Tech.ChEMBL_519215 (CHEMBL946654)
IC50 5.37±n/a nM
Citation Ermondi, GCaron, G GRIND-based 3D-QSAR to predict inhibitory activity for similar enzymes, OSC and SHC. Eur J Med Chem43:1462-8 (2008) 
 
Lanosterol synthase
Name:Lanosterol synthase
Type:PROTEIN
Mol. Mass.:83309.32
Organism:Homo sapiens (Human)
Description:ChEMBL_11231
Residue:732
BDBM50128050
NameBDBM50128050
Synonyms:CHEMBL114259 N-allyl-6-(4-(4-bromobenzoyl)phenoxy)-N-methylhexan-1-aminium | {4-[6-(Allyl-methyl-amino)-hexyloxy]-phenyl}-(4-bromo-phenyl)-methanone
TypeSmall organic molecule
Emp. Form.C23H28BrNO2
Mol. Mass.430.378
SMILESCN(CCCCCCOc1ccc(cc1)C(=O)c1ccc(Br)cc1)CC=C