Reaction Details
TargetBeta-2 adrenergic receptor
LigandBDBM50412983
Substrate/Competitorn/a
Meas. Tech.ChEMBL_516618 (CHEMBL991394)
Ki 2291±n/a nM
Citation Wroblowski, BWigglesworth, MJSzekeres, PGSmith, GDRahman, SSNicholson, NHMuir, AIHall, AHeer, JPGarland, SLCoates, WJ The discovery of a selective, small molecule agonist for the MAS-related gene X1 receptor. J Med Chem52:818-25 (2009) 
 
Beta-2 adrenergic receptor
Name:Beta-2 adrenergic receptor
Type:n/a
Mol. Mass.:46461.69
Organism:Homo sapiens (Human)
Description:P07550
Residue:413
BDBM50412983
NameBDBM50412983
Synonyms:CHEMBL458001
TypeSmall organic molecule
Emp. Form.C28H26ClN5O2
Mol. Mass.499.991
SMILESClc1c(cnn(Cc2cccc(NC(=O)c3ccc(cc3)-c3ccccc3)c2)c1=O)N1CCNCC1