Reaction Details
TargetD(2) dopamine receptor
LigandBDBM50412983
Substrate/Competitorn/a
Meas. Tech.ChEMBL_516619 (CHEMBL991395)
Ki 5248±n/a nM
Citation Wroblowski, BWigglesworth, MJSzekeres, PGSmith, GDRahman, SSNicholson, NHMuir, AIHall, AHeer, JPGarland, SLCoates, WJ The discovery of a selective, small molecule agonist for the MAS-related gene X1 receptor. J Med Chem52:818-25 (2009) 
 
D(2) dopamine receptor
Name:D(2) dopamine receptor
Type:Cell-surface receptors
Mol. Mass.:50647.10
Organism:Homo sapiens (Human)
Description:P14416
Residue:443
BDBM50412983
NameBDBM50412983
Synonyms:CHEMBL458001
TypeSmall organic molecule
Emp. Form.C28H26ClN5O2
Mol. Mass.499.991
SMILESClc1c(cnn(Cc2cccc(NC(=O)c3ccc(cc3)-c3ccccc3)c2)c1=O)N1CCNCC1