Reaction Details
TargetMas-related G-protein coupled receptor member X1
LigandBDBM50412987
Substrate/Competitorn/a
Meas. Tech.ChEMBL_516621 (CHEMBL991397)
EC50 6.3±n/a nM
Citation Wroblowski, BWigglesworth, MJSzekeres, PGSmith, GDRahman, SSNicholson, NHMuir, AIHall, AHeer, JPGarland, SLCoates, WJ The discovery of a selective, small molecule agonist for the MAS-related gene X1 receptor. J Med Chem52:818-25 (2009) 
 
Mas-related G-protein coupled receptor member X1
Name:Mas-related G-protein coupled receptor member X1
Type:PROTEIN
Mol. Mass.:36253.68
Organism:Homo sapiens (Human)
Description:ChEMBL_516621
Residue:322
BDBM50412987
NameBDBM50412987
Synonyms:CHEMBL475965
TypeSmall organic molecule
Emp. Form.C29H30N6O3
Mol. Mass.510.5869
SMILESCOc1ccc(cn1)-c1ccc(cc1)C(=O)Nc1cccc(Cn2ncc(cc2=O)N2CCNCC2)c1C