Reaction Details
TargetD(2) dopamine receptor
LigandBDBM50412985
Substrate/Competitorn/a
Meas. Tech.ChEMBL_516619 (CHEMBL991395)
Ki 5129±n/a nM
Citation Wroblowski, BWigglesworth, MJSzekeres, PGSmith, GDRahman, SSNicholson, NHMuir, AIHall, AHeer, JPGarland, SLCoates, WJ The discovery of a selective, small molecule agonist for the MAS-related gene X1 receptor. J Med Chem52:818-25 (2009) 
 
D(2) dopamine receptor
Name:D(2) dopamine receptor
Type:Cell-surface receptors
Mol. Mass.:50647.10
Organism:Homo sapiens (Human)
Description:P14416
Residue:443
BDBM50412985
NameBDBM50412985
Synonyms:CHEMBL458220
TypeSmall organic molecule
Emp. Form.C29H28ClN5O2
Mol. Mass.514.018
SMILESCc1c(Cn2ncc(N3CCNCC3)c(Cl)c2=O)cccc1NC(=O)c1ccc(cc1)-c1ccccc1