Reaction Details
TargetGastrin/cholecystokinin type B receptor
LigandBDBM50413477
Substrate/Competitorn/a
Meas. Tech.ChEMBL_567122 (CHEMBL1030801)
Ki 1±n/a nM
Citation Akgün, EKörner, MGao, FHarikumar, KGWaser, BReubi, JCPortoghese, PSMiller, LJ Synthesis and in vitro characterization of radioiodinatable benzodiazepines selective for type 1 and type 2 cholecystokinin receptors. J Med Chem52:2138-47 (2009) 
 
Gastrin/cholecystokinin type B receptor
Name:Gastrin/cholecystokinin type B receptor
Type:G Protein-Coupled Receptor (GPCR)
Mol. Mass.:48445.79
Organism:Homo sapiens (Human)
Description:Stable expression of human CCK-2 receptors in HEK 293 cells.
Residue:447
BDBM50413477
NameBDBM50413477
Synonyms:CHEMBL475226
TypeSmall organic molecule
Emp. Form.C23H19IN4O2
Mol. Mass.510.327
SMILESCN1c2ccccc2C(=N[C@H](NC(=O)Nc2cccc(I)c2)C1=O)c1ccccc1