Reaction Details
TargetNeuronal acetylcholine receptor subunit alpha-4
LigandBDBM50088432
Substrate/Competitorn/a
Meas. Tech.ChEMBL_562742 (CHEMBL1022414)
IC50 19.95±n/a nM
Citation Tosco, PAhring, PKDyhring, TPeters, DHarpsøe, KLiljefors, TBalle, T Complementary three-dimensional quantitative structure-activity relationship modeling of binding affinity and functional potency: a study on alpha4beta2 nicotinic ligands. J Med Chem52:2311-6 (2009) 
 
Neuronal acetylcholine receptor subunit alpha-4
Name:Neuronal acetylcholine receptor subunit alpha-4
Type:n/a
Mol. Mass.:69963.49
Organism:Homo sapiens (Human)
Description:NACHRA4
Residue:627
BDBM50088432
NameBDBM50088432
Synonyms:5-(1,4-diazepan-1-yl)nicotinamide CHEMBL70737
TypeSmall organic molecule
Emp. Form.C11H16N4O
Mol. Mass.220.2709
SMILESNC(=O)c1cncc(c1)N1CCCNCC1