Reaction Details
TargetNeuronal acetylcholine receptor subunit alpha-4
LigandBDBM50088448
Substrate/Competitorn/a
Meas. Tech.ChEMBL_562743 (CHEMBL1022415)
EC50 141.25±n/a nM
Citation Tosco, PAhring, PKDyhring, TPeters, DHarpsøe, KLiljefors, TBalle, T Complementary three-dimensional quantitative structure-activity relationship modeling of binding affinity and functional potency: a study on alpha4beta2 nicotinic ligands. J Med Chem52:2311-6 (2009) 
 
Neuronal acetylcholine receptor subunit alpha-4
Name:Neuronal acetylcholine receptor subunit alpha-4
Type:n/a
Mol. Mass.:69963.49
Organism:Homo sapiens (Human)
Description:NACHRA4
Residue:627
BDBM50088448
NameBDBM50088448
Synonyms:5-(1,4-diazepan-1-yl)pyridin-3-ol CHEMBL72262
TypeSmall organic molecule
Emp. Form.C10H15N3O
Mol. Mass.193.2456
SMILESOc1cncc(c1)N1CCCNCC1