Reaction Details
TargetNeuronal acetylcholine receptor subunit alpha-4
LigandBDBM50413479
Substrate/Competitorn/a
Meas. Tech.ChEMBL_562743 (CHEMBL1022415)
EC50 3630.78±n/a nM
Citation Tosco, PAhring, PKDyhring, TPeters, DHarpsøe, KLiljefors, TBalle, T Complementary three-dimensional quantitative structure-activity relationship modeling of binding affinity and functional potency: a study on alpha4beta2 nicotinic ligands. J Med Chem52:2311-6 (2009) 
 
Neuronal acetylcholine receptor subunit alpha-4
Name:Neuronal acetylcholine receptor subunit alpha-4
Type:n/a
Mol. Mass.:69963.49
Organism:Homo sapiens (Human)
Description:NACHRA4
Residue:627
BDBM50413479
NameBDBM50413479
Synonyms:CHEMBL500726
TypeSmall organic molecule
Emp. Form.C14H17N3
Mol. Mass.227.3049
SMILESC1CNCCN(C1)c1cnc2ccccc2c1