Reaction Details
TargetNeuronal acetylcholine receptor subunit alpha-4
LigandBDBM50088438
Substrate/Competitorn/a
Meas. Tech.ChEMBL_562743 (CHEMBL1022415)
EC50 229.09±n/a nM
Citation Tosco, PAhring, PKDyhring, TPeters, DHarpsøe, KLiljefors, TBalle, T Complementary three-dimensional quantitative structure-activity relationship modeling of binding affinity and functional potency: a study on alpha4beta2 nicotinic ligands. J Med Chem52:2311-6 (2009) 
 
Neuronal acetylcholine receptor subunit alpha-4
Name:Neuronal acetylcholine receptor subunit alpha-4
Type:n/a
Mol. Mass.:69963.49
Organism:Homo sapiens (Human)
Description:NACHRA4
Residue:627
BDBM50088438
NameBDBM50088438
Synonyms:1-(pyridin-3-yl)-1,4-diazepane CHEMBL71085 | NS3531, 1
TypeSmall organic molecule
Emp. Form.C10H15N3
Mol. Mass.177.2462
SMILESC1CNCCN(C1)c1cccnc1