Reaction Details
TargetNeuronal acetylcholine receptor subunit alpha-4
LigandBDBM50187438
Substrate/Competitorn/a
Meas. Tech.ChEMBL_562742 (CHEMBL1022414)
IC50 1.29±n/a nM
Citation Tosco, PAhring, PKDyhring, TPeters, DHarpsøe, KLiljefors, TBalle, T Complementary three-dimensional quantitative structure-activity relationship modeling of binding affinity and functional potency: a study on alpha4beta2 nicotinic ligands. J Med Chem52:2311-6 (2009) 
 
Neuronal acetylcholine receptor subunit alpha-4
Name:Neuronal acetylcholine receptor subunit alpha-4
Type:n/a
Mol. Mass.:69963.49
Organism:Homo sapiens (Human)
Description:NACHRA4
Residue:627
BDBM50187438
NameBDBM50187438
Synonyms:(Z)-1-(5-(prop-1-enyloxy)pyridin-3-yl)-1,4-diazepane cis-1-(5-propen-1-yloxypyridin-3-yl)-[1,4]diazepane
TypeSmall organic molecule
Emp. Form.C13H19N3O
Mol. Mass.233.3095
SMILESC\C=C/Oc1cncc(c1)N1CCCNCC1