Reaction Details
TargetHistamine H3 receptor
LigandBDBM50413501
Substrate/Competitorn/a
Meas. Tech.ChEMBL_562954 (CHEMBL1015353)
EC50 7.6±n/a nM
Citation Igel, PSchneider, ESchnell, DElz, SSeifert, RBuschauer, A N(G)-acylated imidazolylpropylguanidines as potent histamine H4 receptor agonists: selectivity by variation of the N(G)-substituent. J Med Chem52:2623-7 (2009) 
 
Histamine H3 receptor
Name:Histamine H3 receptor
Type:G Protein-Coupled Receptor (GPCR)
Mol. Mass.:48691.47
Organism:Homo sapiens (Human)
Description:Binding assays were using CHO cells stably expressing hH3R receptors.
Residue:445
BDBM50413501
NameBDBM50413501
Synonyms:CHEMBL325327 SK-91486
TypeSmall organic molecule
Emp. Form.C7H13N5
Mol. Mass.167.2116
SMILESNC(N)=NCCCc1cnc[nH]1