Reaction Details
TargetHistamine H2 receptor
LigandBDBM50413503
Substrate/Competitorn/a
Meas. Tech.ChEMBL_562964 (CHEMBL1015363)
EC50 78±n/a nM
Citation Igel, PSchneider, ESchnell, DElz, SSeifert, RBuschauer, A N(G)-acylated imidazolylpropylguanidines as potent histamine H4 receptor agonists: selectivity by variation of the N(G)-substituent. J Med Chem52:2623-7 (2009) 
 
Histamine H2 receptor
Name:Histamine H2 receptor
Type:G Protein-Coupled Receptor (GPCR)
Mol. Mass.:40567.22
Organism:Cavia porcellus (domestic guinea pig)
Description:For the H2 receptor-binding assays, guinea pig striatum was used.
Residue:359
BDBM50413503
NameBDBM50413503
Synonyms:CHEMBL514641 | UR-PI141
TypeSmall organic molecule
Emp. Form.C18H22N6O
Mol. Mass.338.4069
SMILESNC(NC(=O)CCc1c[nH]c2ccccc12)=NCCCc1cnc[nH]1