Reaction Details
TargetHistamine H2 receptor
LigandBDBM50413506
Substrate/Competitorn/a
Meas. Tech.ChEMBL_562953 (CHEMBL1015352)
EC50 347±n/a nM
Citation Igel, PSchneider, ESchnell, DElz, SSeifert, RBuschauer, A N(G)-acylated imidazolylpropylguanidines as potent histamine H4 receptor agonists: selectivity by variation of the N(G)-substituent. J Med Chem52:2623-7 (2009) 
 
Histamine H2 receptor
Name:Histamine H2 receptor
Type:G Protein-Coupled Receptor (GPCR)
Mol. Mass.:40115.31
Organism:Homo sapiens (Human)
Description:n/a
Residue:359
BDBM50413506
NameBDBM50413506
Synonyms:CHEMBL474617 | UR-PI147
TypeSmall organic molecule
Emp. Form.C20H25N7O2
Mol. Mass.395.4582
SMILESCN(CCC(=O)NC(N)=NCCCc1cnc[nH]1)C(=O)c1cc2ccccc2[nH]1