Reaction Details
TargetHistamine H2 receptor
LigandBDBM50413505
Substrate/Competitorn/a
Meas. Tech.ChEMBL_562953 (CHEMBL1015352)
EC50 83±n/a nM
Citation Igel, PSchneider, ESchnell, DElz, SSeifert, RBuschauer, A N(G)-acylated imidazolylpropylguanidines as potent histamine H4 receptor agonists: selectivity by variation of the N(G)-substituent. J Med Chem52:2623-7 (2009) 
 
Histamine H2 receptor
Name:Histamine H2 receptor
Type:G Protein-Coupled Receptor (GPCR)
Mol. Mass.:40115.31
Organism:Homo sapiens (Human)
Description:n/a
Residue:359
BDBM50413505
NameBDBM50413505
Synonyms:CHEMBL515428
TypeSmall organic molecule
Emp. Form.C19H23N7O2
Mol. Mass.381.4316
SMILESNC(NC(=O)CCNC(=O)c1cc2ccccc2[nH]1)=NCCCc1cnc[nH]1