Reaction Details
TargetPotassium voltage-gated channel subfamily H member 2
LigandBDBM82070
Substrate/Competitorn/a
Meas. Tech.ChEMBL_540080 (CHEMBL1036648)
IC50 245470.89±n/a nM
Citation Coi, AMassarelli, ITestai, LCalderone, VBianucci, AM Identification of"toxicophoric" features for predicting drug-induced QT interval prolongation. Eur J Med Chem43:2479-88 (2008) 
 
Potassium voltage-gated channel subfamily H member 2
Name:Potassium voltage-gated channel subfamily H member 2
Type:Multi-pass membrane protein
Mol. Mass.:126672.65
Organism:Homo sapiens (Human)
Description:Q12809
Residue:1159
BDBM82070
NameBDBM82070
Synonyms:CAS_29790-52-1 Nicotine-D salicylate US9303017, Nicotine
Typen/a
Emp. Form.C10H14N2
Mol. Mass.162.2316
SMILESCN1CCC[C@H]1c1cccnc1