Reaction Details
TargetCalcium-activated potassium channel subunit alpha-1
LigandBDBM50413657
Substrate/Competitorn/a
Meas. Tech.ChEMBL_544428 (CHEMBL1016925)
IC50 20417.38±n/a nM
Citation Calderone, VFiamingo, FLAmato, GGiorgi, ILivi, OMartelli, AMartinotti, E 1,2,3-Triazol-carboxanilides and 1,2,3-triazol-(N-benzyl)-carboxamides as BK-potassium channel activators. XII. Eur J Med Chem43:2618-26 (2008) 
 
Calcium-activated potassium channel subunit alpha-1
Name:Calcium-activated potassium channel subunit alpha-1
Type:PROTEIN
Mol. Mass.:134382.76
Organism:Rattus norvegicus
Description:ChEMBL_510400
Residue:1209
BDBM50413657
NameBDBM50413657
Synonyms:CHEMBL511864
TypeSmall organic molecule
Emp. Form.C17H16N4O3
Mol. Mass.324.3339
SMILESCc1c(nnn1Cc1ccccc1O)C(=O)Nc1ccccc1O