Reaction Details
TargetCalcium-activated potassium channel subunit alpha-1
LigandBDBM50347497
Substrate/Competitorn/a
Meas. Tech.ChEMBL_544428 (CHEMBL1016925)
IC50 5128.61±n/a nM
Citation Calderone, VFiamingo, FLAmato, GGiorgi, ILivi, OMartelli, AMartinotti, E 1,2,3-Triazol-carboxanilides and 1,2,3-triazol-(N-benzyl)-carboxamides as BK-potassium channel activators. XII. Eur J Med Chem43:2618-26 (2008) 
 
Calcium-activated potassium channel subunit alpha-1
Name:Calcium-activated potassium channel subunit alpha-1
Type:PROTEIN
Mol. Mass.:134382.76
Organism:Rattus norvegicus
Description:ChEMBL_510400
Residue:1209
BDBM50347497
NameBDBM50347497
Synonyms:CHEMBL384903
TypeSmall organic molecule
Emp. Form.C15H8F6N2O2
Mol. Mass.362.2266
SMILESOc1ccc(cc1-n1c2ccc(cc2[nH]c1=O)C(F)(F)F)C(F)(F)F