Reaction Details
Target5-hydroxytryptamine receptor 1A
LigandBDBM50413699
Substrate/Competitorn/a
Meas. Tech.ChEMBL_540308 (CHEMBL1035839)
Ki 6.31±n/a nM
Citation Ward, SEEddershaw, PFlynn, STGordon, LLovell, PJMoore, SHScott, CMSmith, PWThewlis, KMWyman, PA Studies on a series of potent, orally bioavailable, 5-HT(1) receptor ligands--part II. Bioorg Med Chem Lett19:428-32 (2008) 
 
5-hydroxytryptamine receptor 1A
Name:5-hydroxytryptamine receptor 1A
Type:n/a
Mol. Mass.:46122.49
Organism:Homo sapiens (Human)
Description:n/a
Residue:422
BDBM50413699
NameBDBM50413699
Synonyms:CHEMBL459067
TypeSmall organic molecule
Emp. Form.C29H37N3O
Mol. Mass.443.6236
SMILESCc1ccc2c(OCCN3CCC(Cc4cccc(c4)C4CCNCC4)CC3)cccc2n1