Reaction Details
Target5-hydroxytryptamine receptor 1D
LigandBDBM50413702
Substrate/Competitorn/a
Meas. Tech.ChEMBL_540312 (CHEMBL1035843)
Ki 1±n/a nM
Citation Ward, SEEddershaw, PFlynn, STGordon, LLovell, PJMoore, SHScott, CMSmith, PWThewlis, KMWyman, PA Studies on a series of potent, orally bioavailable, 5-HT(1) receptor ligands--part II. Bioorg Med Chem Lett19:428-32 (2008) 
 
5-hydroxytryptamine receptor 1D
Name:5-hydroxytryptamine receptor 1D
Type:G Protein-Coupled Receptor (GPCR)
Mol. Mass.:41920.63
Organism:Homo sapiens (Human)
Description:Receptor binding assays were performed using human clone stably expressed in CHO cells.
Residue:377
BDBM50413702
NameBDBM50413702
Synonyms:CHEMBL462916
TypeSmall organic molecule
Emp. Form.C29H31N3O
Mol. Mass.437.5759
SMILESCc1ccc2c(OCCN3CCC(Cc4cccc(c4)-c4ccncc4)CC3)cccc2n1