Reaction Details
Target5-hydroxytryptamine receptor 1B
LigandBDBM50413704
Substrate/Competitorn/a
Meas. Tech.ChEMBL_540310 (CHEMBL1035841)
Ki 63.1±n/a nM
Citation Ward, SEEddershaw, PFlynn, STGordon, LLovell, PJMoore, SHScott, CMSmith, PWThewlis, KMWyman, PA Studies on a series of potent, orally bioavailable, 5-HT(1) receptor ligands--part II. Bioorg Med Chem Lett19:428-32 (2008) 
 
5-hydroxytryptamine receptor 1B
Name:5-hydroxytryptamine receptor 1B
Type:G Protein-Coupled Receptor (GPCR)
Mol. Mass.:43579.17
Organism:Homo sapiens (Human)
Description:Receptor binding assays were performed using human clone stably expressed in CHO cells
Residue:390
BDBM50413704
NameBDBM50413704
Synonyms:CHEMBL456459
TypeSmall organic molecule
Emp. Form.C30H32N2O
Mol. Mass.436.5879
SMILESCc1ccc2c(OCCN3CCC(Cc4cccc(c4)-c4ccccc4)CC3)cccc2n1