Reaction Details
TargetOxytocin receptor
LigandBDBM50413708
Substrate/Competitorn/a
Meas. Tech.ChEMBL_540346 (CHEMBL1025689)
Ki 39.81±n/a nM
Citation Barton, NPBellenie, BRDoran, ATEmmons, AJHeer, JPSalvagno, CM Discovery and optimisation of a potent and selective tertiary sulfonamide oxytocin antagonist. Bioorg Med Chem Lett19:528-32 (2008) 
 
Oxytocin receptor
Name:Oxytocin receptor
Type:Enzyme Catalytic Domain
Mol. Mass.:42793.26
Organism:Homo sapiens (Human)
Description:Oxytocin OXTR HEK293::B2R9L7
Residue:389
BDBM50413708
NameBDBM50413708
Synonyms:CHEMBL514287
TypeSmall organic molecule
Emp. Form.C22H20N4O5S
Mol. Mass.452.483
SMILESCOc1ccc(cc1)S(=O)(=O)N(Cc1noc(n1)-c1ccccc1)c1ccc(OC)nc1