Reaction Details
TargetOxytocin receptor
LigandBDBM50413713
Substrate/Competitorn/a
Meas. Tech.ChEMBL_540346 (CHEMBL1025689)
Ki 12.59±n/a nM
Citation Barton, NPBellenie, BRDoran, ATEmmons, AJHeer, JPSalvagno, CM Discovery and optimisation of a potent and selective tertiary sulfonamide oxytocin antagonist. Bioorg Med Chem Lett19:528-32 (2008) 
 
Oxytocin receptor
Name:Oxytocin receptor
Type:Enzyme Catalytic Domain
Mol. Mass.:42793.26
Organism:Homo sapiens (Human)
Description:Oxytocin OXTR HEK293::B2R9L7
Residue:389
BDBM50413713
NameBDBM50413713
Synonyms:CHEMBL458634
TypeSmall organic molecule
Emp. Form.C25H22ClN3O4S
Mol. Mass.495.978
SMILESCOc1ccc(cc1)S(=O)(=O)N(Cc1ccc(cn1)-c1ccccc1Cl)c1ccc(OC)nc1