Reaction Details
TargetOxytocin receptor
LigandBDBM50413715
Substrate/Competitorn/a
Meas. Tech.ChEMBL_540346 (CHEMBL1025689)
Ki 6.31±n/a nM
Citation Barton, NPBellenie, BRDoran, ATEmmons, AJHeer, JPSalvagno, CM Discovery and optimisation of a potent and selective tertiary sulfonamide oxytocin antagonist. Bioorg Med Chem Lett19:528-32 (2008) 
 
Oxytocin receptor
Name:Oxytocin receptor
Type:Enzyme Catalytic Domain
Mol. Mass.:42793.26
Organism:Homo sapiens (Human)
Description:Oxytocin OXTR HEK293::B2R9L7
Residue:389
BDBM50413715
NameBDBM50413715
Synonyms:CHEMBL457544
TypeSmall organic molecule
Emp. Form.C25H22FN3O4S
Mol. Mass.479.523
SMILESCOc1ccc(cc1)S(=O)(=O)N(Cc1ccc(cn1)-c1ccccc1F)c1ccc(OC)nc1