Reaction Details
TargetOxytocin receptor
LigandBDBM50413714
Substrate/Competitorn/a
Meas. Tech.ChEMBL_540347 (CHEMBL1025690)
Ki 2±n/a nM
Citation Barton, NPBellenie, BRDoran, ATEmmons, AJHeer, JPSalvagno, CM Discovery and optimisation of a potent and selective tertiary sulfonamide oxytocin antagonist. Bioorg Med Chem Lett19:528-32 (2008) 
 
Oxytocin receptor
Name:Oxytocin receptor
Type:Enzyme Catalytic Domain
Mol. Mass.:42793.26
Organism:Homo sapiens (Human)
Description:Oxytocin OXTR HEK293::B2R9L7
Residue:389
BDBM50413714
NameBDBM50413714
Synonyms:CHEMBL458635
TypeSmall organic molecule
Emp. Form.C26H25N3O4S
Mol. Mass.475.559
SMILESCOc1ccc(cc1)S(=O)(=O)N(Cc1ccc(cn1)-c1ccccc1C)c1ccc(OC)nc1