Reaction Details
TargetVasopressin V1a receptor
LigandBDBM50413715
Substrate/Competitorn/a
Meas. Tech.ChEMBL_540348 (CHEMBL1025691)
Ki 50.12±n/a nM
Citation Barton, NPBellenie, BRDoran, ATEmmons, AJHeer, JPSalvagno, CM Discovery and optimisation of a potent and selective tertiary sulfonamide oxytocin antagonist. Bioorg Med Chem Lett19:528-32 (2008) 
 
Vasopressin V1a receptor
Name:Vasopressin V1a receptor
Type:Receptor
Mol. Mass.:46820.18
Organism:Homo sapiens (Human)
Description:P37288
Residue:418
BDBM50413715
NameBDBM50413715
Synonyms:CHEMBL457544
TypeSmall organic molecule
Emp. Form.C25H22FN3O4S
Mol. Mass.479.523
SMILESCOc1ccc(cc1)S(=O)(=O)N(Cc1ccc(cn1)-c1ccccc1F)c1ccc(OC)nc1