Reaction Details
TargetOxytocin receptor
LigandBDBM50413725
Substrate/Competitorn/a
Meas. Tech.ChEMBL_540346 (CHEMBL1025689)
Ki 1.58±n/a nM
Citation Barton, NPBellenie, BRDoran, ATEmmons, AJHeer, JPSalvagno, CM Discovery and optimisation of a potent and selective tertiary sulfonamide oxytocin antagonist. Bioorg Med Chem Lett19:528-32 (2008) 
 
Oxytocin receptor
Name:Oxytocin receptor
Type:Enzyme Catalytic Domain
Mol. Mass.:42793.26
Organism:Homo sapiens (Human)
Description:Oxytocin OXTR HEK293::B2R9L7
Residue:389
BDBM50413725
NameBDBM50413725
Synonyms:CHEMBL456254
TypeSmall organic molecule
Emp. Form.C27H27N3O5S
Mol. Mass.505.585
SMILESCOc1ccc(OC)c(c1)S(=O)(=O)N(Cc1ccc(cn1)-c1ccccc1C)c1ccc(OC)nc1