Reaction Details
TargetCannabinoid receptor 1
LigandBDBM50413756
Substrate/Competitorn/a
Meas. Tech.ChEMBL_500314 (CHEMBL973406)
IC50 3467.37±n/a nM
Citation Kang, NSLee, GNYoo, SE Predictive models of Cannabinoid-1 receptor antagonists derived from diverse classes. Bioorg Med Chem Lett19:2990-6 (2009) 
 
Cannabinoid receptor 1
Name:Cannabinoid receptor 1
Type:G Protein-Coupled Receptor (GPCR)
Mol. Mass.:52868.96
Organism:Homo sapiens (Human)
Description:P21554
Residue:472
BDBM50413756
NameBDBM50413756
Synonyms:CHEMBL513683
TypeSmall organic molecule
Emp. Form.C23H27Cl2N3O
Mol. Mass.432.386
SMILESClc1ccc(cc1)C(N1CCN(CC1)C(=O)NCC1CCC1)c1ccc(Cl)cc1