Reaction Details
TargetCannabinoid receptor 1
LigandBDBM50161567
Substrate/Competitorn/a
Meas. Tech.ChEMBL_500314 (CHEMBL973406)
IC50 1905.46±n/a nM
Citation Kang, NSLee, GNYoo, SE Predictive models of Cannabinoid-1 receptor antagonists derived from diverse classes. Bioorg Med Chem Lett19:2990-6 (2009) 
 
Cannabinoid receptor 1
Name:Cannabinoid receptor 1
Type:G Protein-Coupled Receptor (GPCR)
Mol. Mass.:52868.96
Organism:Homo sapiens (Human)
Description:P21554
Residue:472
BDBM50161567
NameBDBM50161567
Synonyms:1-Methyl-4,5-diphenyl-1H-imidazole-2-carboxylic acid piperidin-1-ylamide CHEMBL361182
TypeSmall organic molecule
Emp. Form.C22H24N4O
Mol. Mass.360.4522
SMILESCn1c(nc(c1-c1ccccc1)-c1ccccc1)C(=O)NN1CCCCC1